Reaction Details
TargetAcetylcholinesterase
LigandBDBM50068302
Substrate/Competitorn/a
Meas. Tech.ChEMBL_1466466 (CHEMBL3406576)
IC50 10.0±n/a nM
Citation Wieckowska, AWieckowski, KBajda, MBrus, BSalat, KCzerwinska, PGobec, SFilipek, BMalawska, B Synthesis of new N-benzylpiperidine derivatives as cholinesterase inhibitors withß-amyloid anti-aggregation properties and beneficial effects on memory in vivo. Bioorg Med Chem23:2445-57 (2015) 
 
Acetylcholinesterase
Name:Acetylcholinesterase
Type:Enzyme
Mol. Mass.:71812.79
Organism:Electrophorus electricus (Electric eel)
Description:n/a
Residue:633
BDBM50068302
NameBDBM50068302
Synonyms:CHEMBL3402305
TypeSmall organic molecule
Emp. Form.C26H35N3
Mol. Mass.389.5762
SMILESC(CCCn1ccc2ccccc12)CCNC1CCN(Cc2ccccc2)CC1