Reaction Details
TargetKinesin-like protein KIF11
LigandBDBM50068357
Substrate/Competitorn/a
Meas. Tech.ChEMBL_1466497 (CHEMBL3406807)
EC50 452±n/a nM
Citation Mansoor, UFAngeles, ARDai, CYang, LVitharana, DBasso, ADGray, KTang, HLiu, MLiang, LAllbritton, OSiddiqui, MA Discovery of novel spiro 1,3,4-thiadiazolines as potent, orally bioavailable and brain penetrant KSP inhibitors. Bioorg Med Chem23:2424-34 (2015) 
 
Kinesin-like protein KIF11
Name:Kinesin-like protein KIF11
Type:PROTEIN
Mol. Mass.:119138.97
Organism:Homo sapiens (Human)
Description:ChEMBL_1457426
Residue:1056
BDBM50068357
NameBDBM50068357
Synonyms:CHEMBL3402343
TypeSmall organic molecule
Emp. Form.C19H16F2N2O2S
Mol. Mass.374.404
SMILESCCC(=O)N1N=C(SC11CCOc2ccccc12)c1cc(F)ccc1F