Reaction Details
TargetKinesin-like protein KIF11
LigandBDBM50068387
Substrate/Competitorn/a
Meas. Tech.ChEMBL_1466497 (CHEMBL3406807)
EC50>1000±n/a nM
Citation Mansoor, UFAngeles, ARDai, CYang, LVitharana, DBasso, ADGray, KTang, HLiu, MLiang, LAllbritton, OSiddiqui, MA Discovery of novel spiro 1,3,4-thiadiazolines as potent, orally bioavailable and brain penetrant KSP inhibitors. Bioorg Med Chem23:2424-34 (2015) 
 
Kinesin-like protein KIF11
Name:Kinesin-like protein KIF11
Type:PROTEIN
Mol. Mass.:119138.97
Organism:Homo sapiens (Human)
Description:ChEMBL_1457426
Residue:1056
BDBM50068387
NameBDBM50068387
Synonyms:CHEMBL3402348
TypeSmall organic molecule
Emp. Form.C18H15F2N3O2S
Mol. Mass.375.392
SMILESNCC(=O)N1N=C(SC11CCOc2ccccc12)c1cc(F)ccc1F