Reaction Details
TargetTyrosine-protein phosphatase non-receptor type 6
LigandBDBM50068877
Substrate/Competitorn/a
Meas. Tech.ChEMBL_1466567 (CHEMBL3407024)
IC50 9250±n/a nM
Citation Chen, JGao, LXGong, JXJiang, CSYao, LGLi, JYLi, JXiao, WGuo, YW Design and synthesis of novel 1,2-dithiolan-4-yl benzoate derivatives as PTP1B inhibitors. Bioorg Med Chem Lett25:2211-6 (2015) 
 
Tyrosine-protein phosphatase non-receptor type 6
Name:Tyrosine-protein phosphatase non-receptor type 6
Type:Protein
Mol. Mass.:67570.41
Organism:Homo sapiens (Human)
Description:P29350
Residue:595
BDBM50068877
NameBDBM50068877
Synonyms:CHEMBL3402410
TypeSmall organic molecule
Emp. Form.C23H21NO6S2
Mol. Mass.471.546
SMILES[O-][N+](=O)c1ccccc1C(=O)OCCCCC#Cc1ccc(cc1)C(=O)OC1CSSC1