Reaction Details
TargetCoagulation factor VII
LigandBDBM50068982
Substrate/Competitorn/a
Meas. Tech.ChEMBL_1466580 (CHEMBL3407173)
Ki 1.7±n/a nM
Citation Glunz, PWCheng, XCheney, DLWeigelt, CAWei, ALuettgen, JMWong, PCWexler, RRPriestley, ES Design and synthesis of potent, selective phenylimidazole-based FVIIa inhibitors. Bioorg Med Chem Lett25:2169-73 (2015) 
 
Coagulation factor VII
Name:Coagulation factor VII
Type:Enzyme
Mol. Mass.:51599.89
Organism:Homo sapiens (Human)
Description:n/a
Residue:466
BDBM50068982
NameBDBM50068982
Synonyms:CHEMBL3403479
TypeSmall organic molecule
Emp. Form.C29H31FN6O3
Mol. Mass.530.5932
SMILESCCOc1cc(OC(C)C)c(F)c(c1)C(Nc1ccc(cc1)C(N)=N)c1nc(c[nH]1)-c1ccccc1C(N)=O