Reaction Details
TargetCoagulation factor VII
LigandBDBM14714
Substrate/Competitorn/a
Meas. Tech.ChEMBL_1466589 (CHEMBL3407182)
Ki 0.350000±n/a nM
Citation Glunz, PWCheng, XCheney, DLWeigelt, CAWei, ALuettgen, JMWong, PCWexler, RRPriestley, ES Design and synthesis of potent, selective phenylimidazole-based FVIIa inhibitors. Bioorg Med Chem Lett25:2169-73 (2015) 
 
Coagulation factor VII
Name:Coagulation factor VII
Type:Enzyme
Mol. Mass.:51599.89
Organism:Homo sapiens (Human)
Description:n/a
Residue:466
BDBM14714
NameBDBM14714
Synonyms:(2R)-N-[(3-aminobenzene)sulfonyl]-2-[(4-carbamimidoyl-3-hydroxyphenyl)amino]-2-(3,5-diethoxy-2-fluorophenyl)acetamide R-4-[2-(3-aminobenzenesulfonylamino)-1-(3,5-diethoxy-2-fluorophenyl)-2-oxoethylamino]-2-hydroxy-benzamidine.TFA
TypeSmall organic molecule
Emp. Form.C25H28FN5O6S
Mol. Mass.545.583
SMILESCCOc1cc(OCC)c(F)c(c1)[C@@H](Nc1ccc(C(N)=N)c(O)c1)C(=O)NS(=O)(=O)c1cccc(N)c1