Reaction Details
TargetNeurotensin receptor type 1
LigandBDBM50019423
Substrate/Competitorn/a
Meas. Tech.ChEMBL_1466612 (CHEMBL3407205)
Ki 3210±n/a nM
Citation Thomas, JBGiddings, AMOlepu, SWiethe, RWWarner, KRSarret, PLongpre, JMRunyon, SPGilmour, BP The amide linker in nonpeptide neurotensin receptor ligands plays a key role in calcium signaling at the neurotensin receptor type 2. Bioorg Med Chem Lett25:2060-4 (2015) 
 
Neurotensin receptor type 1
Name:Neurotensin receptor type 1
Type:PROTEIN
Mol. Mass.:47070.64
Organism:Rattus norvegicus
Description:ChEMBL_1466612
Residue:424
BDBM50019423
NameBDBM50019423
Synonyms:CHEMBL3290105
TypeSmall organic molecule
Emp. Form.C25H26FN3O5
Mol. Mass.467.4894
SMILESCOc1cccc(OC)c1-c1cc(nn1-c1ccc(F)cc1)C(=O)NC1(CCCCC1)C(O)=O