Reaction Details
TargetNeurotensin receptor type 2
LigandBDBM50069088
Substrate/Competitorn/a
Meas. Tech.ChEMBL_1466613 (CHEMBL3407206)
Ki>10000±n/a nM
Citation Thomas, JBGiddings, AMOlepu, SWiethe, RWWarner, KRSarret, PLongpre, JMRunyon, SPGilmour, BP The amide linker in nonpeptide neurotensin receptor ligands plays a key role in calcium signaling at the neurotensin receptor type 2. Bioorg Med Chem Lett25:2060-4 (2015) 
 
Neurotensin receptor type 2
Name:Neurotensin receptor type 2
Type:PROTEIN
Mol. Mass.:46280.50
Organism:Rattus norvegicus
Description:ChEMBL_1466615
Residue:416
BDBM50069088
NameBDBM50069088
Synonyms:CHEMBL3403504
TypeSmall organic molecule
Emp. Form.C29H31ClN4O4
Mol. Mass.535.034
SMILESCOc1cccc(OC)c1-c1cc(CN[C@@H](C2CCCCC2)C(O)=O)nn1-c1ccnc2cc(Cl)ccc12