Reaction Details
TargetNeurotensin receptor type 2
LigandBDBM50069092
Substrate/Competitorn/a
Meas. Tech.ChEMBL_1466613 (CHEMBL3407206)
Ki 6339±n/a nM
Citation Thomas, JBGiddings, AMOlepu, SWiethe, RWWarner, KRSarret, PLongpre, JMRunyon, SPGilmour, BP The amide linker in nonpeptide neurotensin receptor ligands plays a key role in calcium signaling at the neurotensin receptor type 2. Bioorg Med Chem Lett25:2060-4 (2015) 
 
Neurotensin receptor type 2
Name:Neurotensin receptor type 2
Type:PROTEIN
Mol. Mass.:46280.50
Organism:Rattus norvegicus
Description:ChEMBL_1466615
Residue:416
BDBM50069092
NameBDBM50069092
Synonyms:CHEMBL3403508
TypeSmall organic molecule
Emp. Form.C24H24FN3O4
Mol. Mass.437.4635
SMILESCOc1ccccc1-c1cc(NC(=O)C2(CCCCC2)C(O)=O)nn1-c1ccc(F)cc1