Reaction Details
TargetPlatelet-derived growth factor receptor beta
LigandBDBM50069096
Substrate/Competitorn/a
Meas. Tech.ChEMBL_1466621 (CHEMBL3404063)
IC50 58±n/a nM
Citation Zhang, XRaghavan, SIhnat, MHamel, EZammiello, CBastian, AMooberry, SLGangjee, A The design, synthesis and biological evaluation of conformationally restricted 4-substituted-2,6-dimethylfuro[2,3-d]pyrimidines as multi-targeted receptor tyrosine kinase and microtubule inhibitors as potential antitumor agents. Bioorg Med Chem23:2408-23 (2015) 
 
Platelet-derived growth factor receptor beta
Name:Platelet-derived growth factor receptor beta
Type:Enzyme
Mol. Mass.:123922.25
Organism:Homo sapiens (Human)
Description:P09619
Residue:1106
BDBM50069096
NameBDBM50069096
Synonyms:CHEMBL3403517 | US10189853, Compound 10
TypeSmall organic molecule
Emp. Form.C18H19N3O2
Mol. Mass.309.3624
SMILESCOc1ccc2N(CCCc2c1)c1nc(C)nc2oc(C)cc12