Reaction Details
TargetEpidermal growth factor receptor
LigandBDBM50069098
Substrate/Competitorn/a
Meas. Tech.ChEMBL_1466619 (CHEMBL3404061)
IC50>500±n/a nM
Citation Zhang, XRaghavan, SIhnat, MHamel, EZammiello, CBastian, AMooberry, SLGangjee, A The design, synthesis and biological evaluation of conformationally restricted 4-substituted-2,6-dimethylfuro[2,3-d]pyrimidines as multi-targeted receptor tyrosine kinase and microtubule inhibitors as potential antitumor agents. Bioorg Med Chem23:2408-23 (2015) 
 
Epidermal growth factor receptor
Name:Epidermal growth factor receptor
Type:Receptor Kinase Domain
Mol. Mass.:134279.59
Organism:Homo sapiens (Human)
Description:P00533
Residue:1210
BDBM50069098
NameBDBM50069098
Synonyms:CHEMBL3403519 | US10189853, Compound 12
TypeSmall organic molecule
Emp. Form.C17H19N3O2
Mol. Mass.297.3517
SMILESCCOc1ccc(cc1)N(C)c1nc(C)nc2oc(C)cc12