Reaction Details
TargetPlatelet-derived growth factor receptor beta
LigandBDBM50069098
Substrate/Competitorn/a
Meas. Tech.ChEMBL_1466621 (CHEMBL3404063)
IC50 132±n/a nM
Citation Zhang, XRaghavan, SIhnat, MHamel, EZammiello, CBastian, AMooberry, SLGangjee, A The design, synthesis and biological evaluation of conformationally restricted 4-substituted-2,6-dimethylfuro[2,3-d]pyrimidines as multi-targeted receptor tyrosine kinase and microtubule inhibitors as potential antitumor agents. Bioorg Med Chem23:2408-23 (2015) 
 
Platelet-derived growth factor receptor beta
Name:Platelet-derived growth factor receptor beta
Type:Enzyme
Mol. Mass.:123922.25
Organism:Homo sapiens (Human)
Description:P09619
Residue:1106
BDBM50069098
NameBDBM50069098
Synonyms:CHEMBL3403519 | US10189853, Compound 12
TypeSmall organic molecule
Emp. Form.C17H19N3O2
Mol. Mass.297.3517
SMILESCCOc1ccc(cc1)N(C)c1nc(C)nc2oc(C)cc12