Reaction Details
TargetVascular endothelial growth factor receptor 2
LigandBDBM50069100
Substrate/Competitorn/a
Meas. Tech.ChEMBL_1466620 (CHEMBL3404062)
IC50 20±n/a nM
Citation Zhang, XRaghavan, SIhnat, MHamel, EZammiello, CBastian, AMooberry, SLGangjee, A The design, synthesis and biological evaluation of conformationally restricted 4-substituted-2,6-dimethylfuro[2,3-d]pyrimidines as multi-targeted receptor tyrosine kinase and microtubule inhibitors as potential antitumor agents. Bioorg Med Chem23:2408-23 (2015) 
 
Vascular endothelial growth factor receptor 2
Name:Vascular endothelial growth factor receptor 2
Type:Receptor Tyrosine Kinase
Mol. Mass.:151510.97
Organism:Homo sapiens (Human)
Description:P35968
Residue:1356
BDBM50069100
NameBDBM50069100
Synonyms:CHEMBL3403512 | US10189853, Compound 5
TypeSmall organic molecule
Emp. Form.C16H15N3O3
Mol. Mass.297.3086
SMILESCN(c1ccc2OCOc2c1)c1nc(C)nc2oc(C)cc12