Reaction Details
TargetEpidermal growth factor receptor
LigandBDBM50069103
Substrate/Competitorn/a
Meas. Tech.ChEMBL_1466619 (CHEMBL3404061)
IC50 162±n/a nM
Citation Zhang, XRaghavan, SIhnat, MHamel, EZammiello, CBastian, AMooberry, SLGangjee, A The design, synthesis and biological evaluation of conformationally restricted 4-substituted-2,6-dimethylfuro[2,3-d]pyrimidines as multi-targeted receptor tyrosine kinase and microtubule inhibitors as potential antitumor agents. Bioorg Med Chem23:2408-23 (2015) 
 
Epidermal growth factor receptor
Name:Epidermal growth factor receptor
Type:Receptor Kinase Domain
Mol. Mass.:134279.59
Organism:Homo sapiens (Human)
Description:P00533
Residue:1210
BDBM50069103
NameBDBM50069103
Synonyms:CHEMBL3403509 | US10189853, Compound 2
TypeSmall organic molecule
Emp. Form.C17H19N3O3
Mol. Mass.313.3511
SMILESCOc1ccc(N(C)c2nc(C)nc3oc(C)cc23)c(OC)c1