Reaction Details
TargetSimilar to alpha-tubulin isoform 1
LigandBDBM50022542
Substrate/Competitorn/a
Meas. Tech.ChEMBL_1466693 (CHEMBL3404291)
IC50 2400±n/a nM
Citation Zhang, XRaghavan, SIhnat, MHamel, EZammiello, CBastian, AMooberry, SLGangjee, A The design, synthesis and biological evaluation of conformationally restricted 4-substituted-2,6-dimethylfuro[2,3-d]pyrimidines as multi-targeted receptor tyrosine kinase and microtubule inhibitors as potential antitumor agents. Bioorg Med Chem23:2408-23 (2015) 
 
Similar to alpha-tubulin isoform 1
Name:Similar to alpha-tubulin isoform 1
Synonyms:Similar to alpha-tubulin isoform 1
Type:PROTEIN
Mol. Mass.:10383.05
Organism:Bos taurus
Description:ChEMBL_104716
Residue:99
BDBM50022542
NameBDBM50022542
TypeSmall organic molecule
Emp. Form.C16H17N3O2
Mol. Mass.283.3251
SMILESCOc1ccc(cc1)N(C)c1nc(C)nc2oc(C)cc12