Reaction Details
TargetHepatocyte growth factor activator
LigandBDBM50069105
Substrate/Competitorn/a
Meas. Tech.ChEMBL_1466701 (CHEMBL3404299)
Ki 590±n/a nM
Citation Franco, FMJones, DEHarris, PKHan, ZWildman, SAJarvis, CMJanetka, JW Structure-based discovery of small molecule hepsin and HGFA protease inhibitors: Evaluation of potency and selectivity derived from distinct binding pockets. Bioorg Med Chem23:2328-43 (2015) 
 
Hepatocyte growth factor activator
Name:Hepatocyte growth factor activator
Type:PROTEIN
Mol. Mass.:70690.18
Organism:Homo sapiens (Human)
Description:ChEMBL_109514
Residue:655
BDBM50069105
NameBDBM50069105
Synonyms:CHEMBL3403520
TypeSmall organic molecule
Emp. Form.C24H26N6O4S
Mol. Mass.494.566
SMILESCCc1cc(cc2c(C)coc12)[C@@H](Nc1ccc(cc1)C(N)=N)C(=O)NS(=O)(=O)c1cn(C)cn1