Reaction Details
TargetSerine protease hepsin
LigandBDBM50069112
Substrate/Competitorn/a
Meas. Tech.ChEMBL_1466699 (CHEMBL3404297)
Ki 1200±n/a nM
Citation Franco, FMJones, DEHarris, PKHan, ZWildman, SAJarvis, CMJanetka, JW Structure-based discovery of small molecule hepsin and HGFA protease inhibitors: Evaluation of potency and selectivity derived from distinct binding pockets. Bioorg Med Chem23:2328-43 (2015) 
 
Serine protease hepsin
Name:Serine protease hepsin
Type:Enzyme
Mol. Mass.:45016.98
Organism:Homo sapiens (Human)
Description:Human deglycosylated hepsin was expressed in Pichia pastoris.
Residue:417
BDBM50069112
NameBDBM50069112
Synonyms:CHEMBL3400827
TypeSmall organic molecule
Emp. Form.C31H40N6O4S
Mol. Mass.592.752
SMILESCCCCCCNC(=O)N1CCN(CC1)C(=O)[C@H](Cc1cccc(c1)C(N)=N)NS(=O)(=O)c1ccc2ccccc2c1