Reaction Details
TargetSerine protease hepsin
LigandBDBM50069113
Substrate/Competitorn/a
Meas. Tech.ChEMBL_1466699 (CHEMBL3404297)
Ki 670±n/a nM
Citation Franco, FMJones, DEHarris, PKHan, ZWildman, SAJarvis, CMJanetka, JW Structure-based discovery of small molecule hepsin and HGFA protease inhibitors: Evaluation of potency and selectivity derived from distinct binding pockets. Bioorg Med Chem23:2328-43 (2015) 
 
Serine protease hepsin
Name:Serine protease hepsin
Type:Enzyme
Mol. Mass.:45016.98
Organism:Homo sapiens (Human)
Description:Human deglycosylated hepsin was expressed in Pichia pastoris.
Residue:417
BDBM50069113
NameBDBM50069113
Synonyms:CHEMBL3403533
TypeSmall organic molecule
Emp. Form.C30H36N6O4S
Mol. Mass.576.71
SMILESCc1ccc(cc1)S(=O)(=O)N[C@@H](Cc1cccc(c1)C(N)=N)C(=O)N1CCN(CC1)C(=O)NCCc1ccccc1