Reaction Details
TargetSuppressor of tumorigenicity 14 protein
LigandBDBM23886
Substrate/Competitorn/a
Meas. Tech.ChEMBL_1466698 (CHEMBL3404296)
Ki 120±n/a nM
Citation Franco, FMJones, DEHarris, PKHan, ZWildman, SAJarvis, CMJanetka, JW Structure-based discovery of small molecule hepsin and HGFA protease inhibitors: Evaluation of potency and selectivity derived from distinct binding pockets. Bioorg Med Chem23:2328-43 (2015) 
 
Suppressor of tumorigenicity 14 protein
Name:Suppressor of tumorigenicity 14 protein
Type:Single-pass type II membrane protein
Mol. Mass.:94769.23
Organism:Homo sapiens (Human)
Description:Q9Y5Y6
Residue:855
BDBM23886
NameBDBM23886
Synonyms:3-[(2S)-3-oxo-3-[4-(piperidin-4-ylcarbonyl)piperazin-1-yl]-2-{[2,4,6-tris(propan-2-yl)benzene]sulfonamido}propyl]benzene-1-carboximidamide | 3-amidinophenylalanine deriv., 30
TypeSmall organic molecule
Emp. Form.C35H52N6O4S
Mol. Mass.652.89
SMILESCC(C)c1cc(C(C)C)c(c(c1)C(C)C)S(=O)(=O)N[C@@H](Cc1cccc(c1)C(N)=N)C(=O)N1CCN(CC1)C(=O)C1CCNCC1