Reaction Details
TargetHepatocyte growth factor activator
LigandBDBM50069123
Substrate/Competitorn/a
Meas. Tech.ChEMBL_1466696 (CHEMBL3404294)
IC50>50000±n/a nM
Citation Franco, FMJones, DEHarris, PKHan, ZWildman, SAJarvis, CMJanetka, JW Structure-based discovery of small molecule hepsin and HGFA protease inhibitors: Evaluation of potency and selectivity derived from distinct binding pockets. Bioorg Med Chem23:2328-43 (2015) 
 
Hepatocyte growth factor activator
Name:Hepatocyte growth factor activator
Type:PROTEIN
Mol. Mass.:70690.18
Organism:Homo sapiens (Human)
Description:ChEMBL_109514
Residue:655
BDBM50069123
NameBDBM50069123
Synonyms:CHEMBL579653
TypeSmall organic molecule
Emp. Form.C14H14N4O
Mol. Mass.254.2872
SMILESNC(=N)Nc1ccc(NC(=O)c2ccccc2)cc1