Reaction Details
TargetHepatocyte growth factor activator
LigandBDBM50069125
Substrate/Competitorn/a
Meas. Tech.ChEMBL_1466696 (CHEMBL3404294)
IC50>50000±n/a nM
Citation Franco, FMJones, DEHarris, PKHan, ZWildman, SAJarvis, CMJanetka, JW Structure-based discovery of small molecule hepsin and HGFA protease inhibitors: Evaluation of potency and selectivity derived from distinct binding pockets. Bioorg Med Chem23:2328-43 (2015) 
 
Hepatocyte growth factor activator
Name:Hepatocyte growth factor activator
Type:PROTEIN
Mol. Mass.:70690.18
Organism:Homo sapiens (Human)
Description:ChEMBL_109514
Residue:655
BDBM50069125
NameBDBM50069125
Synonyms:CHEMBL3403527
TypeSmall organic molecule
Emp. Form.C14H16N4O2S
Mol. Mass.304.367
SMILESCc1ccc(cc1)S(=O)(=O)Nc1ccc(NC(N)=N)cc1