Reaction Details
TargetSuppressor of tumorigenicity 14 protein
LigandBDBM50063698
Substrate/Competitorn/a
Meas. Tech.ChEMBL_1466698 (CHEMBL3404296)
Ki 0.020000±n/a nM
Citation Franco, FMJones, DEHarris, PKHan, ZWildman, SAJarvis, CMJanetka, JW Structure-based discovery of small molecule hepsin and HGFA protease inhibitors: Evaluation of potency and selectivity derived from distinct binding pockets. Bioorg Med Chem23:2328-43 (2015) 
 
Suppressor of tumorigenicity 14 protein
Name:Suppressor of tumorigenicity 14 protein
Type:Single-pass type II membrane protein
Mol. Mass.:94769.23
Organism:Homo sapiens (Human)
Description:Q9Y5Y6
Residue:855
BDBM50063698
NameBDBM50063698
Synonyms:4-Guanidino-benzoic acid 6-carbamimidoyl-naphthalen-2-yl ester CHEMBL273264 | Nafamostat
TypeSmall organic molecule
Emp. Form.C19H17N5O2
Mol. Mass.347.3706
SMILES[#7]\[#6](-[#7])=[#7]/c1ccc(cc1)-[#6](=O)-[#8]-c1ccc2cc(ccc2c1)-[#6](-[#7])=[#7]