Reaction Details
TargetSuppressor of tumorigenicity 14 protein
LigandBDBM50069121
Substrate/Competitorn/a
Meas. Tech.ChEMBL_1466698 (CHEMBL3404296)
Ki 7180±n/a nM
Citation Franco, FMJones, DEHarris, PKHan, ZWildman, SAJarvis, CMJanetka, JW Structure-based discovery of small molecule hepsin and HGFA protease inhibitors: Evaluation of potency and selectivity derived from distinct binding pockets. Bioorg Med Chem23:2328-43 (2015) 
 
Suppressor of tumorigenicity 14 protein
Name:Suppressor of tumorigenicity 14 protein
Type:Single-pass type II membrane protein
Mol. Mass.:94769.23
Organism:Homo sapiens (Human)
Description:Q9Y5Y6
Residue:855
BDBM50069121
NameBDBM50069121
Synonyms:CHEMBL3403521
TypeSmall organic molecule
Emp. Form.C24H26N6O4S
Mol. Mass.494.566
SMILESCCc1cc(cc2c(C)coc12)C(Nc1ccc(cc1)C(N)=N)C(=O)NS(=O)(=O)c1cn(C)cn1