Reaction Details
TargetHepatocyte growth factor activator
LigandBDBM23886
Substrate/Competitorn/a
Meas. Tech.ChEMBL_1466697 (CHEMBL3404295)
Ki 5500±n/a nM
Citation Franco, FMJones, DEHarris, PKHan, ZWildman, SAJarvis, CMJanetka, JW Structure-based discovery of small molecule hepsin and HGFA protease inhibitors: Evaluation of potency and selectivity derived from distinct binding pockets. Bioorg Med Chem23:2328-43 (2015) 
 
Hepatocyte growth factor activator
Name:Hepatocyte growth factor activator
Type:PROTEIN
Mol. Mass.:70690.18
Organism:Homo sapiens (Human)
Description:ChEMBL_109514
Residue:655
BDBM23886
NameBDBM23886
Synonyms:3-[(2S)-3-oxo-3-[4-(piperidin-4-ylcarbonyl)piperazin-1-yl]-2-{[2,4,6-tris(propan-2-yl)benzene]sulfonamido}propyl]benzene-1-carboximidamide | 3-amidinophenylalanine deriv., 30
TypeSmall organic molecule
Emp. Form.C35H52N6O4S
Mol. Mass.652.89
SMILESCC(C)c1cc(C(C)C)c(c(c1)C(C)C)S(=O)(=O)N[C@@H](Cc1cccc(c1)C(N)=N)C(=O)N1CCN(CC1)C(=O)C1CCNCC1