Reaction Details
TargetRho-associated protein kinase 2
LigandBDBM50069136
Substrate/Competitorn/a
Meas. Tech.ChEMBL_1466703 (CHEMBL3404496)
IC50<1.000000±n/a nM
Citation Mei, DYin, YWu, FCui, JZhou, HSun, GJiang, YFeng, Y Discovery of potent and selective urea-based ROCK inhibitors: Exploring the inhibitor's potency and ROCK2/PKA selectivity by 3D-QSAR, molecular docking and molecular dynamics simulations. Bioorg Med Chem23:2505-17 (2015) 
 
Rho-associated protein kinase 2
Name:Rho-associated protein kinase 2
Type:Protein
Mol. Mass.:160885.43
Organism:Homo sapiens (Human)
Description:O75116
Residue:1388
BDBM50069136
NameBDBM50069136
Synonyms:CHEMBL3402460
TypeSmall organic molecule
Emp. Form.C25H31N5O3
Mol. Mass.449.5453
SMILESCOc1cccc(CN(C)C(=O)Nc2ccc(cc2OCCN2CCCC2)-c2cn[nH]c2)c1