Reaction Details
TargetCarbonic anhydrase
LigandBDBM10877
Substrate/Competitorn/a
Meas. Tech.ChEMBL_1466707 (CHEMBL3404500)
Ki>100000±n/a nM
Citation Syrjänen, LKuuslahti, MTolvanen, MVullo, DParkkila, SSupuran, CT Theß-carbonic anhydrase from the malaria mosquito Anopheles gambiae is highly inhibited by sulfonamides. Bioorg Med Chem23:2303-9 (2015) 
 
Carbonic anhydrase
Name:Carbonic anhydrase
Type:PROTEIN
Mol. Mass.:29919.95
Organism:Anopheles gambiae
Description:ChEMBL_109570
Residue:255
BDBM10877
NameBDBM10877
Synonyms:4-(2-hydroxyethyl)benzene-1-sulfonamide JMC522226 Compound 21 aromatic/heteroaromatic sulfonamide 22
TypeSmall organic molecule
Emp. Form.C8H11NO3S
Mol. Mass.201.243
SMILESNS(=O)(=O)c1ccc(CCO)cc1