Reaction Details
TargetCarbonic anhydrase 2
LigandBDBM81920
Substrate/Competitorn/a
Meas. Tech.ChEMBL_1466706 (CHEMBL3404499)
Ki 80±n/a nM
Citation Syrjänen, LKuuslahti, MTolvanen, MVullo, DParkkila, SSupuran, CT Theß-carbonic anhydrase from the malaria mosquito Anopheles gambiae is highly inhibited by sulfonamides. Bioorg Med Chem23:2303-9 (2015) 
 
Carbonic anhydrase 2
Name:Carbonic anhydrase 2
Type:Enzyme
Mol. Mass.:29250.71
Organism:Homo sapiens (Human)
Description:P00918
Residue:260
BDBM81920
NameBDBM81920
Synonyms:p-Hydroxy-benzene derivative, 3a
TypeSmall organic molecule
Emp. Form.C6H7NO3S
Mol. Mass.173.19
SMILESNS(=O)(=O)c1ccc(O)cc1