Reaction Details
TargetCarbonic anhydrase 2
LigandBDBM50427224
Substrate/Competitorn/a
Meas. Tech.ChEMBL_1466706 (CHEMBL3404499)
Ki 8.0±n/a nM
Citation Syrjänen, LKuuslahti, MTolvanen, MVullo, DParkkila, SSupuran, CT Theß-carbonic anhydrase from the malaria mosquito Anopheles gambiae is highly inhibited by sulfonamides. Bioorg Med Chem23:2303-9 (2015) 
 
Carbonic anhydrase 2
Name:Carbonic anhydrase 2
Type:Enzyme
Mol. Mass.:29250.71
Organism:Homo sapiens (Human)
Description:P00918
Residue:260
BDBM50427224
NameBDBM50427224
Synonyms:Benzene-1,3-Disulfonamide | CHEMBL2324868
TypeSmall organic molecule
Emp. Form.C6H8N2O4S2
Mol. Mass.236.269
SMILESNS(=O)(=O)c1cccc(c1)S(N)(=O)=O