Reaction Details
TargetCarbonic anhydrase 1
LigandBDBM81920
Substrate/Competitorn/a
Meas. Tech.ChEMBL_1466705 (CHEMBL3404498)
Ki 5500±n/a nM
Citation Syrjänen, LKuuslahti, MTolvanen, MVullo, DParkkila, SSupuran, CT Theß-carbonic anhydrase from the malaria mosquito Anopheles gambiae is highly inhibited by sulfonamides. Bioorg Med Chem23:2303-9 (2015) 
 
Carbonic anhydrase 1
Name:Carbonic anhydrase 1
Type:Enzyme
Mol. Mass.:28873.37
Organism:Homo sapiens (Human)
Description:P00915
Residue:261
BDBM81920
NameBDBM81920
Synonyms:p-Hydroxy-benzene derivative, 3a
TypeSmall organic molecule
Emp. Form.C6H7NO3S
Mol. Mass.173.19
SMILESNS(=O)(=O)c1ccc(O)cc1