Reaction Details
TargetTyrosine-protein kinase JAK2
LigandBDBM50069316
Substrate/Competitorn/a
Meas. Tech.ChEMBL_1466708 (CHEMBL3404501)
IC50 1.000000±n/a nM
Citation Brasca, MGGnocchi, PNesi, MAmboldi, NAvanzi, NBertrand, JBindi, SCanevari, GCasero, DCiomei, MColombo, NCribioli, SFachin, GFelder, ERGalvani, AIsacchi, AMotto, IPanzeri, ADonati, D Novel pyrrole carboxamide inhibitors of JAK2 as potential treatment of myeloproliferative disorders. Bioorg Med Chem23:2387-407 (2015) 
 
Tyrosine-protein kinase JAK2
Name:Tyrosine-protein kinase JAK2
Type:Protein
Mol. Mass.:130684.68
Organism:Homo sapiens (Human)
Description:O60674
Residue:1132
BDBM50069316
NameBDBM50069316
Synonyms:CHEMBL3403549 | US9688661, 1-[2-Chloro-5-(trifluoromethyl)phenyl]-4-(7H-pyrrolo[2,3-d]pyrimidin-4-yl)-1H-pyrrole-2-carboxamide (compd 244)
TypeSmall organic molecule
Emp. Form.C18H11ClF3N5O
Mol. Mass.405.761
SMILESNC(=O)c1cc(cn1-c1cc(ccc1Cl)C(F)(F)F)-c1ncnc2[nH]ccc12