Reaction Details
TargetSodium- and chloride-dependent GABA transporter 2
LigandBDBM112777
Substrate/Competitorn/a
Meas. Tech.ChEMBL_1466786 (CHEMBL3405542)
IC50 269153±n/a nM
Citation Vogensen, SBJørgensen, LMadsen, KKJurik, ABorkar, NRosatelli, ENielsen, BEcker, GFSchousboe, AClausen, RP Structure activity relationship of selective GABA uptake inhibitors. Bioorg Med Chem23:2480-8 (2015) 
 
Sodium- and chloride-dependent GABA transporter 2
Name:Sodium- and chloride-dependent GABA transporter 2
Type:PROTEIN
Mol. Mass.:68283.40
Organism:Mus musculus
Description:ChEMBL_1460089
Residue:602
BDBM112777
NameBDBM112777
Synonyms:NORTRIPTYLINE | US8629135, SW-02
TypeSmall organic molecule
Emp. Form.C19H21N
Mol. Mass.263.3767
SMILES[#6]-[#7]-[#6]-[#6]\[#6]=[#6]-1/c2ccccc2-[#6]-[#6]-c2ccccc-12