Reaction Details
TargetE3 ubiquitin-protein ligase Mdm2
LigandBDBM50069631
Substrate/Competitorn/a
Meas. Tech.ChEMBL_1466806 (CHEMBL3405562)
IC50 2.2±n/a nM
Citation Miyazaki, MUoto, KSugimoto, YNaito, HYoshida, KOkayama, TKawato, HMiyazaki, MKitagawa, MSeki, TFukutake, SAonuma, MSoga, T Discovery of DS-5272 as a promising candidate: A potent and orally active p53-MDM2 interaction inhibitor. Bioorg Med Chem23:2360-7 (2015) 
 
E3 ubiquitin-protein ligase Mdm2
Name:E3 ubiquitin-protein ligase Mdm2
Type:Oncoprotein
Mol. Mass.:55196.54
Organism:Homo sapiens (Human)
Description:Q00987
Residue:491
BDBM50069631
NameBDBM50069631
Synonyms:CHEMBL3402520
TypeSmall organic molecule
Emp. Form.C33H36Cl2F2N6O2S
Mol. Mass.689.646
SMILESCC(C)C1=C(SC2=N[C@](C)([C@H](N12)c1ccc(Cl)c(F)c1)c1ccc(Cl)nc1)C(=O)N1C[C@H](F)C[C@H]1C(=O)N1CC2(CC2)NC[C@@H]1C