Reaction Details
TargetTyrosine-protein phosphatase non-receptor type 1
LigandBDBM50056315
Substrate/Competitorn/a
Meas. Tech.ChEMBL_1466859 (CHEMBL3405965)
IC50 39000±n/a nM
Citation Li, JLGao, LXMeng, FWTang, CLZhang, RJLi, JYLuo, CLi, JZhao, WM PTP1B inhibitors from stems of Angelica keiskei (Ashitaba). Bioorg Med Chem Lett25:2028-32 (2015) 
 
Tyrosine-protein phosphatase non-receptor type 1
Name:Tyrosine-protein phosphatase non-receptor type 1
Type:Protein phosphatase
Mol. Mass.:49963.76
Organism:Homo sapiens (Human)
Description:Human recombinant GST-fusion PTP1B (1-435).
Residue:435
BDBM50056315
NameBDBM50056315
Synonyms:CHEBI:17558 | Quercitrin
TypeSmall organic molecule
Emp. Form.C21H20O11
Mol. Mass.448.3769
SMILESC[C@@H]1O[C@@H](Oc2c(oc3cc(O)cc(O)c3c2=O)-c2ccc(O)c(O)c2)[C@H](O)[C@H](O)[C@H]1O