Reaction Details
TargetScavenger receptor class B member 1
LigandBDBM50069751
Substrate/Competitorn/a
Meas. Tech.ChEMBL_1466967 (CHEMBL3406606)
IC50 5.0±n/a nM
Citation Dockendorff, CFaloon, PWPu, JYu, MJohnston, SBennion, MPenman, MNieland, TJDandapani, SPerez, JRMunoz, BPalmer, MASchreiber, SLKrieger, M Benzo-fused lactams from a diversity-oriented synthesis (DOS) library as inhibitors of scavenger receptor BI (SR-BI)-mediated lipid uptake. Bioorg Med Chem Lett25:2100-5 (2015) 
 
Scavenger receptor class B member 1
Name:Scavenger receptor class B member 1
Type:PROTEIN
Mol. Mass.:56761.39
Organism:Mus musculus
Description:ChEMBL_103999
Residue:509
BDBM50069751
NameBDBM50069751
Synonyms:CHEMBL2356114
TypeSmall organic molecule
Emp. Form.C24H32N6O4
Mol. Mass.468.5487
SMILESC[C@@H](N(C1CCCCC1)C(=O)Cn1nnc(n1)-c1ccc2OCOc2c1)C(=O)NC1CCCC1