Reaction Details
TargetUbiquitin carboxyl-terminal hydrolase 10
LigandBDBM50069761
Substrate/Competitorn/a
Meas. Tech.ChEMBL_1469497 (CHEMBL3412294)
IC50 600±n/a nM
Citation Ndubaku, CTsui, V Inhibiting the deubiquitinating enzymes (DUBs). J Med Chem58:1581-95 (2015) 
 
Ubiquitin carboxyl-terminal hydrolase 10
Name:Ubiquitin carboxyl-terminal hydrolase 10
Type:PROTEIN
Mol. Mass.:87115.60
Organism:Homo sapiens (Human)
Description:ChEMBL_109582
Residue:798
BDBM50069761
NameBDBM50069761
Synonyms:CHEMBL2391504
TypeSmall organic molecule
Emp. Form.C15H11F2N3
Mol. Mass.271.2647
SMILESFc1ccc(CNc2ncnc3ccc(F)cc23)cc1