Reaction Details
TargetE3 ubiquitin-protein ligase Mdm2
LigandBDBM50069798
Substrate/Competitorn/a
Meas. Tech.ChEMBL_1469730 (CHEMBL3413418)
IC50 0.500000±n/a nM
Citation Rew, YSun, DYan, XBeck, HPCanon, JChen, ADuquette, JEksterowicz, JFox, BMFu, JGonzalez, AZHouze, JHuang, XJiang, MJin, LLi, YLi, ZLing, YLo, MCLong, AMMcGee, LRMcIntosh, JOliner, JDOsgood, TSaiki, AYShaffer, PWang, YCWortman, SYakowec, PYe, QYu, DZhao, XZhou, JMedina, JCOlson, SH Discovery of AM-7209, a potent and selective 4-amidobenzoic acid inhibitor of the MDM2-p53 interaction. J Med Chem57:10499-511 (2014) 
 
E3 ubiquitin-protein ligase Mdm2
Name:E3 ubiquitin-protein ligase Mdm2
Type:Oncoprotein
Mol. Mass.:55196.54
Organism:Homo sapiens (Human)
Description:Q00987
Residue:491
BDBM50069798
NameBDBM50069798
Synonyms:CHEMBL3407576
TypeSmall organic molecule
Emp. Form.C37H41Cl2FN2O7S
Mol. Mass.747.7
SMILESCOc1cc(NC(=O)C[C@@]2(C)C[C@@H]([C@H](N([C@H](CS(=O)(=O)C(C)(C)C)C3CC3)C2=O)c2ccc(Cl)cc2)c2cccc(Cl)c2F)ccc1C(O)=O