Reaction Details
TargetAmine oxidase [flavin-containing] B
LigandBDBM50069802
Substrate/Competitorn/a
Meas. Tech.ChEMBL_1469746 (CHEMBL3413434)
IC50 184±n/a nM
Citation Bautista-Aguilera, OMSamadi, AChioua, MNikolic, KFilipic, SAgbaba, DSoriano, Ede Andrés, LRodríguez-Franco, MIAlcaro, SRamsay, RROrtuso, FYañez, MMarco-Contelles, J N-Methyl-N-((1-methyl-5-(3-(1-(2-methylbenzyl)piperidin-4-yl)propoxy)-1H-indol-2-yl)methyl)prop-2-yn-1-amine, a new cholinesterase and monoamine oxidase dual inhibitor. J Med Chem57:10455-63 (2014) 
 
Amine oxidase [flavin-containing] B
Name:Amine oxidase [flavin-containing] B
Type:Protein
Mol. Mass.:58768.76
Organism:Homo sapiens (Human)
Description:P27338
Residue:520
BDBM50069802
NameBDBM50069802
Synonyms:CHEMBL3407581
TypeSmall organic molecule
Emp. Form.C30H39N3O
Mol. Mass.457.6502
SMILESCN(CC#C)Cc1cc2cc(OCCCC3CCN(Cc4ccccc4C)CC3)ccc2n1C