Reaction Details
TargetAmine oxidase [flavin-containing] A
LigandBDBM50069811
Substrate/Competitorn/a
Meas. Tech.ChEMBL_1469745 (CHEMBL3413433)
IC50 10300±n/a nM
Citation Bautista-Aguilera, OMSamadi, AChioua, MNikolic, KFilipic, SAgbaba, DSoriano, Ede Andrés, LRodríguez-Franco, MIAlcaro, SRamsay, RROrtuso, FYañez, MMarco-Contelles, J N-Methyl-N-((1-methyl-5-(3-(1-(2-methylbenzyl)piperidin-4-yl)propoxy)-1H-indol-2-yl)methyl)prop-2-yn-1-amine, a new cholinesterase and monoamine oxidase dual inhibitor. J Med Chem57:10455-63 (2014) 
 
Amine oxidase [flavin-containing] A
Name:Amine oxidase [flavin-containing] A
Type:Protein
Mol. Mass.:59689.53
Organism:Homo sapiens (Human)
Description:P21397
Residue:527
BDBM50069811
NameBDBM50069811
Synonyms:CHEMBL3407588
TypeSmall organic molecule
Emp. Form.C33H40N4O2
Mol. Mass.524.6963
SMILESCOc1ccc(CN2CCC(CCCOc3ccc4n(C)c(CN(C)CC#C)cc4c3)CC2)c2cccnc12