Reaction Details
TargetAmine oxidase [flavin-containing] A
LigandBDBM50087800
Substrate/Competitorn/a
Meas. Tech.ChEMBL_1469745 (CHEMBL3413433)
IC50 287±n/a nM
Citation Bautista-Aguilera, OMSamadi, AChioua, MNikolic, KFilipic, SAgbaba, DSoriano, Ede Andrés, LRodríguez-Franco, MIAlcaro, SRamsay, RROrtuso, FYañez, MMarco-Contelles, J N-Methyl-N-((1-methyl-5-(3-(1-(2-methylbenzyl)piperidin-4-yl)propoxy)-1H-indol-2-yl)methyl)prop-2-yn-1-amine, a new cholinesterase and monoamine oxidase dual inhibitor. J Med Chem57:10455-63 (2014) 
 
Amine oxidase [flavin-containing] A
Name:Amine oxidase [flavin-containing] A
Type:Protein
Mol. Mass.:59689.53
Organism:Homo sapiens (Human)
Description:P21397
Residue:527
BDBM50087800
NameBDBM50087800
Synonyms:(5-Benzyloxy-1H-indol-2-ylmethyl)-prop-2-ynyl-amine | CHEMBL45069
TypeSmall organic molecule
Emp. Form.C19H18N2O
Mol. Mass.290.359
SMILESC#CCNCc1cc2cc(OCc3ccccc3)ccc2[nH]1