Reaction Details
TargetAdenosine receptor A3
LigandBDBM50069991
Substrate/Competitorn/a
Meas. Tech.ChEMBL_1469765 (CHEMBL3413616)
Ki 0.630000±n/a nM
Citation Tosh, DKFinley, APaoletta, SMoss, SMGao, ZGGizewski, ETAuchampach, JASalvemini, DJacobson, KA In vivo phenotypic screening for treating chronic neuropathic pain: modification of C2-arylethynyl group of conformationally constrained A3 adenosine receptor agonists. J Med Chem57:9901-14 (2014) 
 
Adenosine receptor A3
Name:Adenosine receptor A3
Type:G Protein-Coupled Receptor (GPCR)
Mol. Mass.:36197.32
Organism:Homo sapiens (Human)
Description:P0DMS8
Residue:318
BDBM50069991
NameBDBM50069991
Synonyms:CHEMBL3407768
TypeSmall organic molecule
Emp. Form.C23H24N6O4
Mol. Mass.448.4745
SMILES[H][C@]12C[C@]1([C@@H](O)[C@@H](O)[C@@H]2n1cnc2c(NC)nc(nc12)C#Cc1ccc(OC)cc1)C(=O)NC