Reaction Details
TargetThymidylate synthase
LigandBDBM50070024
Substrate/Competitorn/a
Meas. Tech.ChEMBL_1469977 (CHEMBL3414404)
IC50 75000±n/a nM
Citation Tochowicz, ASantucci, MSaxena, PGuaitoli, GTrande, MFiner-Moore, JStroud, RMCosti, MP Alanine mutants of the interface residues of human thymidylate synthase decode key features of the binding mode of allosteric anticancer peptides. J Med Chem58:1012-8 (2015) 
 
Thymidylate synthase
Name:Thymidylate synthase
Type:Enzyme
Mol. Mass.:35718.07
Organism:Homo sapiens (Human)
Description:n/a
Residue:313
BDBM50070024
NameBDBM50070024
Synonyms:CHEMBL3125097
TypeSmall organic molecule
Emp. Form.C43H71N13O13S
Mol. Mass.1010.168
SMILESCC(C)C[C@H](N)C(=O)N[C@@H](CO)C(=O)N[C@@H](CS)C(=O)N[C@@H](CCC(N)=O)C(=O)N[C@@H](CC(C)C)C(=O)N[C@@H](Cc1ccc(O)cc1)C(=O)N[C@@H](CCC(N)=O)C(=O)N[C@@H](CCCNC(N)=N)C(O)=O