Reaction Details
TargetThymidylate synthase
LigandBDBM50070035
Substrate/Competitorn/a
Meas. Tech.ChEMBL_1469978 (CHEMBL3411863)
IC50 57000±n/a nM
Citation Tochowicz, ASantucci, MSaxena, PGuaitoli, GTrande, MFiner-Moore, JStroud, RMCosti, MP Alanine mutants of the interface residues of human thymidylate synthase decode key features of the binding mode of allosteric anticancer peptides. J Med Chem58:1012-8 (2015) 
 
Thymidylate synthase
Name:Thymidylate synthase
Type:Enzyme
Mol. Mass.:35718.07
Organism:Homo sapiens (Human)
Description:n/a
Residue:313
BDBM50070035
NameBDBM50070035
Synonyms:CHEMBL3407793
TypeSmall organic molecule
Emp. Form.C40H63N9O15
Mol. Mass.909.9795
SMILESCC(C)C[C@H](NC(=O)[C@H](CCC(O)=O)NC(=O)[C@H](CO)NC(=O)[C@H](CC(N)=O)NC(=O)[C@@H](NC(=O)[C@@H](NC(=O)[C@@H](N)Cc1ccc(O)cc1)C(C)C)C(C)C)C(=O)N[C@@H](CO)C(O)=O