Reaction Details
TargetThymidylate synthase
LigandBDBM50070034
Substrate/Competitorn/a
Meas. Tech.ChEMBL_1469979 (CHEMBL3411864)
IC50 300000±n/a nM
Citation Tochowicz, ASantucci, MSaxena, PGuaitoli, GTrande, MFiner-Moore, JStroud, RMCosti, MP Alanine mutants of the interface residues of human thymidylate synthase decode key features of the binding mode of allosteric anticancer peptides. J Med Chem58:1012-8 (2015) 
 
Thymidylate synthase
Name:Thymidylate synthase
Type:Enzyme
Mol. Mass.:35718.07
Organism:Homo sapiens (Human)
Description:n/a
Residue:313
BDBM50070034
NameBDBM50070034
Synonyms:CHEMBL3407792
TypeSmall organic molecule
Emp. Form.C46H68N10O12S
Mol. Mass.985.157
SMILESCC(C)C[C@H](N)C(=O)N[C@@H](CS)C(=O)N[C@@H](CCC(N)=O)C(=O)N[C@@H](Cc1ccccc1)C(=O)N[C@@H](Cc1ccc(O)cc1)C(=O)N[C@@H](C(C)C)C(=O)N[C@@H](C(C)C)C(=O)N[C@@H](CC(N)=O)C(O)=O