Reaction Details
TargetNitric oxide synthase, brain
LigandBDBM50070060
Substrate/Competitorn/a
Meas. Tech.ChEMBL_1470204 (CHEMBL3412923)
Ki 18±n/a nM
Citation Mukherjee, PLi, HSevrioukova, IChreifi, GMartásek, PRoman, LJPoulos, TLSilverman, RB Novel 2,4-disubstituted pyrimidines as potent, selective, and cell-permeable inhibitors of neuronal nitric oxide synthase. J Med Chem58:1067-88 (2015) 
 
Nitric oxide synthase, brain
Name:Nitric oxide synthase, brain
Type:Enzyme
Mol. Mass.:160570.98
Organism:Rattus norvegicus (rat)
Description:Recombinant nNOS overexpressed in E. coli was used in enzyme assays.
Residue:1429
BDBM50070060
NameBDBM50070060
Synonyms:CHEMBL3407822
TypeSmall organic molecule
Emp. Form.C19H21ClFN5
Mol. Mass.373.855
SMILESCl.Fc1cccc(C[C@@H]2C[C@H]2NCCc2ccnc(n2)-n2ccnc2)c1