Reaction Details
TargetFatty acid synthase
LigandBDBM50070208
Substrate/Competitorn/a
Meas. Tech.ChEMBL_1467001 (CHEMBL3411198)
Ki 5300±n/a nM
Citation Fako, VEWu, XPflug, BLiu, JYZhang, JT Repositioning proton pump inhibitors as anticancer drugs by targeting the thioesterase domain of human fatty acid synthase. J Med Chem58:778-84 (2015) 
 
Fatty acid synthase
Name:Fatty acid synthase
Type:Enzyme
Mol. Mass.:273419.37
Organism:Homo sapiens (Human)
Description:P49327
Residue:2511
BDBM50070208
NameBDBM50070208
Synonyms:A-65006 CHEBI:6375 Prevacid Prevacid Delayed Release Prevacid iv
TypeSmall organic molecule
Emp. Form.C16H14F3N3O2S
Mol. Mass.369.361
SMILESCc1c(OCC(F)(F)F)ccnc1C[S+]([O-])c1nc2ccccc2[nH]1