Reaction Details
TargetNischarin
LigandBDBM50070363
Substrate/Competitorn/a
Meas. Tech.ChEMBL_1467221 (CHEMBL3411418)
Ki 27±n/a nM
Citation Gasparik, VGreney, HSchann, SFeldman, JFellmann, LEhrhardt, JDBousquet, P Synthesis and biological evaluation of 2-aryliminopyrrolidines as selective ligands for I1 imidazoline receptors: discovery of new sympatho-inhibitory hypotensive agents with potential beneficial effects in metabolic syndrome. J Med Chem58:878-87 (2015) 
 
Nischarin
Name:Nischarin
Type:Enzyme Catalytic Domain
Mol. Mass.:166460.59
Organism:RAT
Description:Q4G017
Residue:1502
BDBM50070363
NameBDBM50070363
Synonyms:CHEMBL3408284
TypeSmall organic molecule
Emp. Form.C12H16Cl2N2
Mol. Mass.259.175
SMILESCl.CC1CC\C(N1)=N/c1cccc(Cl)c1C