Reaction Details
TargetMu-type opioid receptor
LigandBDBM50346330
Substrate/Competitorn/a
Meas. Tech.ChEMBL_1467660 (CHEMBL3411022)
Ki 0.150000±n/a nM
Citation Guillemyn, KKleczkowska, PLesniak, ADyniewicz, JVan der Poorten, OVan den Eynde, IKeresztes, AVarga, ELai, JPorreca, FChung, NNLemieux, CMika, JRojewska, EMakuch, WVan Duppen, JPrzewlocka, BVanden Broeck, JLipkowski, AWSchiller, PWTourwé, DBallet, S Synthesis and biological evaluation of compact, conformationally constrained bifunctional opioid agonist - neurokinin-1 antagonist peptidomimetics. Eur J Med Chem92:64-77 (2015) 
 
Mu-type opioid receptor
Name:Mu-type opioid receptor
Type:G Protein-Coupled Receptor (GPCR)
Mol. Mass.:44503.11
Organism:Rattus norvegicus (rat)
Description:Competition binding assays were carried out using membrane preparations from transfected HN9.10 cells that constitutively expressed the mu opioid receptor.
Residue:398
BDBM50346330
NameBDBM50346330
Synonyms:(R)-N-((S)-2-(2-amino-2-oxoethyl)-3-oxo-2,3,4,5-tetrahydro-1H-benzo[c]azepin-4-yl)-2-((S)-2-amino-3-(4-hydroxy-2,6-dimethylphenyl)propanamido)-5-guanidinopentanamide | CHEMBL1782140
TypeSmall organic molecule
Emp. Form.C29H40N8O5
Mol. Mass.580.6785
SMILES[#6]-c1cc(-[#8])cc(-[#6])c1-[#6]-[#6@H](-[#7])-[#6](=O)-[#7]-[#6@H](-[#6]-[#6]-[#6]\[#7]=[#6](\[#7])-[#7])-[#6](=O)-[#7]-[#6@H]-1-[#6]-c2ccccc2-[#6]-[#7](-[#6]-[#6](-[#7])=O)-[#6]-1=O