Reaction Details
TargetMu-type opioid receptor
LigandBDBM50070377
Substrate/Competitorn/a
Meas. Tech.ChEMBL_1467660 (CHEMBL3411022)
Ki 0.080000±n/a nM
Citation Guillemyn, KKleczkowska, PLesniak, ADyniewicz, JVan der Poorten, OVan den Eynde, IKeresztes, AVarga, ELai, JPorreca, FChung, NNLemieux, CMika, JRojewska, EMakuch, WVan Duppen, JPrzewlocka, BVanden Broeck, JLipkowski, AWSchiller, PWTourwé, DBallet, S Synthesis and biological evaluation of compact, conformationally constrained bifunctional opioid agonist - neurokinin-1 antagonist peptidomimetics. Eur J Med Chem92:64-77 (2015) 
 
Mu-type opioid receptor
Name:Mu-type opioid receptor
Type:G Protein-Coupled Receptor (GPCR)
Mol. Mass.:44503.11
Organism:Rattus norvegicus (rat)
Description:Competition binding assays were carried out using membrane preparations from transfected HN9.10 cells that constitutively expressed the mu opioid receptor.
Residue:398
BDBM50070377
NameBDBM50070377
Synonyms:CHEMBL3408519
TypeSmall organic molecule
Emp. Form.C38H50N8O5
Mol. Mass.698.8542
SMILES[H][C@@]1(Cc2ccccc2CN(CCC(=O)N(C)Cc2ccccc2)C1=O)NC(=O)[C@@H](CCCNC(N)=N)NC(=O)[C@@H](N)Cc1c(C)cc(O)cc1C