Reaction Details
TargetDelta-type opioid receptor
LigandBDBM50346329
Substrate/Competitorn/a
Meas. Tech.ChEMBL_1467661 (CHEMBL3411023)
Ki 10±n/a nM
Citation Guillemyn, KKleczkowska, PLesniak, ADyniewicz, JVan der Poorten, OVan den Eynde, IKeresztes, AVarga, ELai, JPorreca, FChung, NNLemieux, CMika, JRojewska, EMakuch, WVan Duppen, JPrzewlocka, BVanden Broeck, JLipkowski, AWSchiller, PWTourwé, DBallet, S Synthesis and biological evaluation of compact, conformationally constrained bifunctional opioid agonist - neurokinin-1 antagonist peptidomimetics. Eur J Med Chem92:64-77 (2015) 
 
Delta-type opioid receptor
Name:Delta-type opioid receptor
Type:G Protein-Coupled Receptor (GPCR)
Mol. Mass.:40465.04
Organism:Rattus norvegicus (rat)
Description:Competition binding assays were using CHO-K1 cell membranes expressing the opioid receptor.
Residue:372
BDBM50346329
NameBDBM50346329
Synonyms:(R)-2-((S)-2-amino-3-(4-hydroxy-2,6-dimethylphenyl)propanamido)-N-((S)-2-(2-((3,5-bis(trifluoromethyl)benzyl)(methyl)amino)-2-oxoethyl)-3-oxo-2,3,4,5-tetrahydro-1H-benzo[c]azepin-4-yl)-5-guanidinopentanamide | CHEMBL1782141
TypeSmall organic molecule
Emp. Form.C39H46F6N8O5
Mol. Mass.820.8236
SMILES[#6]-[#7](-[#6]-c1cc(cc(c1)C(F)(F)F)C(F)(F)F)-[#6](=O)-[#6]-[#7]-1-[#6]-c2ccccc2-[#6]-[#6@H](-[#7]-[#6](=O)-[#6@@H](-[#6]-[#6]-[#6]\[#7]=[#6](\[#7])-[#7])-[#7]-[#6](=O)-[#6@@H](-[#7])-[#6]-c2c(-[#6])cc(-[#8])cc2-[#6])-[#6]-1=O