Reaction Details
TargetDelta-type opioid receptor
LigandBDBM50070385
Substrate/Competitorn/a
Meas. Tech.ChEMBL_1467661 (CHEMBL3411023)
Ki 4.4±n/a nM
Citation Guillemyn, KKleczkowska, PLesniak, ADyniewicz, JVan der Poorten, OVan den Eynde, IKeresztes, AVarga, ELai, JPorreca, FChung, NNLemieux, CMika, JRojewska, EMakuch, WVan Duppen, JPrzewlocka, BVanden Broeck, JLipkowski, AWSchiller, PWTourwé, DBallet, S Synthesis and biological evaluation of compact, conformationally constrained bifunctional opioid agonist - neurokinin-1 antagonist peptidomimetics. Eur J Med Chem92:64-77 (2015) 
 
Delta-type opioid receptor
Name:Delta-type opioid receptor
Type:G Protein-Coupled Receptor (GPCR)
Mol. Mass.:40465.04
Organism:Rattus norvegicus (rat)
Description:Competition binding assays were using CHO-K1 cell membranes expressing the opioid receptor.
Residue:372
BDBM50070385
NameBDBM50070385
Synonyms:CHEMBL3408736
TypeSmall organic molecule
Emp. Form.C37H50N8O5
Mol. Mass.686.8435
SMILESCN(CC(=O)N(C)Cc1ccccc1)C(=O)C(Cc1ccccc1)NC(=O)C(CCCNC(N)=N)NC(=O)C(N)Cc1c(C)cc(O)cc1C